Reaction Details
TargetMuscarinic acetylcholine receptor M2
LigandBDBM50408539
Substrate/Competitorn/a
Meas. Tech.ChEMBL_138172 (CHEMBL858421)
Ki 2.5±n/a nM
Citation Bolognesi, MLMinarini, ABudriesi, RCacciaguerra, SChiarini, ASpampinato, STumiatti, VMelchiorre, C Universal template approach to drug design: polyamines as selective muscarinic receptor antagonists. J Med Chem41:4150-60 (1998) 
 
Muscarinic acetylcholine receptor M2
Name:Muscarinic acetylcholine receptor M2
Type:Enzyme Catalytic Domain
Mol. Mass.:51555.53
Organism:RAT
Description:P10980
Residue:466
BDBM50408539
NameBDBM50408539
Synonyms:CHEMBL407678
TypeSmall organic molecule
Emp. Form.C64H73N13O8
Mol. Mass.1152.3467
SMILESCN(CCCCCCCCN(C)C(=O)CCCCCN(CC(=O)N1c2ccccc2C(=O)Nc2cccnc12)CC(=O)N1c2ccccc2C(=O)Nc2cccnc12)C(=O)CCCCCNCC(=O)N1c2ccccc2C(=O)Nc2cccnc12