Reaction Details
TargetMuscarinic acetylcholine receptor M1
LigandBDBM50408527
Substrate/Competitorn/a
Meas. Tech.ChEMBL_139096 (CHEMBL744272)
Ki 15±n/a nM
Citation Bolognesi, MLMinarini, ABudriesi, RCacciaguerra, SChiarini, ASpampinato, STumiatti, VMelchiorre, C Universal template approach to drug design: polyamines as selective muscarinic receptor antagonists. J Med Chem41:4150-60 (1998) 
 
Muscarinic acetylcholine receptor M1
Name:Muscarinic acetylcholine receptor M1
Type:Enzyme Catalytic Domain
Mol. Mass.:51390.46
Organism:RAT
Description:P08482
Residue:460
BDBM50408527
NameBDBM50408527
Synonyms:CHEMBL1202004
TypeSmall organic molecule
Emp. Form.C52H70N8O4
Mol. Mass.871.1634
SMILESCN(CCCCCCCCN(C)CCCCCCNCC(=O)N1c2ccccc2NC(=O)c2ccccc12)CCCCCCNCC(=O)N1c2ccccc2NC(=O)c2ccccc12