Reaction Details
TargetMuscarinic acetylcholine receptor M1
LigandBDBM50408535
Substrate/Competitorn/a
Meas. Tech.ChEMBL_139096 (CHEMBL744272)
Ki 0.50±n/a nM
Citation Bolognesi, MLMinarini, ABudriesi, RCacciaguerra, SChiarini, ASpampinato, STumiatti, VMelchiorre, C Universal template approach to drug design: polyamines as selective muscarinic receptor antagonists. J Med Chem41:4150-60 (1998) 
 
Muscarinic acetylcholine receptor M1
Name:Muscarinic acetylcholine receptor M1
Type:Enzyme Catalytic Domain
Mol. Mass.:51390.46
Organism:RAT
Description:P08482
Residue:460
BDBM50408535
NameBDBM50408535
Synonyms:CHEMBL131865
TypeSmall organic molecule
Emp. Form.C38H63N7O2
Mol. Mass.649.9525
SMILESCN(CCCCCCN)CCCCCCCCN(C)CCCCCCNCCCC(=O)N1c2ccccc2C(=O)Nc2cccnc12