Reaction Details
TargetNeuronal acetylcholine receptor subunit alpha-9
LigandBDBM82070
Substrate/Competitorn/a
Meas. Tech.ChEMBL_142899 (CHEMBL748708)
Kd 5±n/a nM
Citation Horti, AGScheffel, UKimes, ASMusachio, JLRavert, HTMathews, WBZhan, YFinley, PALondon, EDDannals, RF Synthesis and evaluation of N-[11C]methylated analogues of epibatidine as tracers for positron emission tomographic studies of nicotinic acetylcholine receptors. J Med Chem41:4199-206 (1998) 
 
Neuronal acetylcholine receptor subunit alpha-9
Name:Neuronal acetylcholine receptor subunit alpha-9
Type:Enzyme Catalytic Domain
Mol. Mass.:54522.69
Organism:RAT
Description:Cholinergic, Nicotinic Muscle 0 RAT::P43144
Residue:479
BDBM82070
NameBDBM82070
Synonyms:CAS_29790-52-1 Nicotine-D salicylate US9303017, Nicotine
Typen/a
Emp. Form.C10H14N2
Mol. Mass.162.2316
SMILESCN1CCC[C@H]1c1cccnc1