Reaction Details
TargetMelatonin receptor type 1A
LigandBDBM29611
Substrate/Competitorn/a
Meas. Tech.ChEMBL_105108 (CHEMBL856174)
IC50 1±n/a nM
Citation Marot, CChavatte, PMorin-Allory, LViaud, MCGuillaumet, GRenard, PLesieur, DMichel, A Pharmacophoric search and 3D-QSAR comparative molecular field analysis studies on agonists of melatonin sheep receptors. J Med Chem41:4453-65 (1998) 
 
Melatonin receptor type 1A
Name:Melatonin receptor type 1A
Type:Enzyme
Mol. Mass.:39392.94
Organism:Homo sapiens (Human)
Description:P48039
Residue:350
BDBM29611
NameBDBM29611
Synonyms:2-Iodomelatonin Melatonin,2-Iodo
TypeSmall organic molecule
Emp. Form.C13H15IN2O2
Mol. Mass.358.1749
SMILESCOc1ccc2[nH]c(I)c(CCNC(C)=O)c2c1