Reaction Details
TargetHistidine-rich protein PFHRP-II
LigandBDBM50408762
Substrate/Competitorn/a
Meas. Tech.ChEMBL_155111 (CHEMBL763685)
IC50 15000±n/a nM
Citation Vippagunta, SRDorn, AMatile, HBhattacharjee, AKKarle, JMEllis, WYRidley, RGVennerstrom, JL Structural specificity of chloroquine-hematin binding related to inhibition of hematin polymerization and parasite growth. J Med Chem42:4630-9 (1999) Histidine-rich protein PFHRP-II
Name:Histidine-rich protein PFHRP-II
Type:PROTEIN
Mol. Mass.:35156.49
Organism:Plasmodium falciparum
Description:ChEMBL_500704
Residue:332
BDBM50408762
NameBDBM50408762
Synonyms:DESETHYLCHLOROQUINE | Desethyl chloroquine
TypeSmall organic molecule
Emp. Form.C16H22ClN3
Mol. Mass.291.819
SMILESCCNCCCC(C)Nc1ccnc2cc(Cl)ccc12