Reaction Details
TargetReverse transcriptase/RNaseH
LigandBDBM50145605
Substrate/Competitorn/a
Meas. Tech.ChEMBL_42166 (CHEMBL655350)
EC50 31±n/a nM
Citation Pontikis, RDollé, VGuillaumel, JDechaux, ENote, RNguyen, CHLegraverend, MBisagni, EAubertin, AMGrierson, DSMonneret, C Synthesis and evaluation of"AZT-HEPT","AZT-pyridinone", and"ddC-HEPT" conjugates as inhibitors of HIV reverse transcriptase. J Med Chem43:1927-39 (2000) Reverse transcriptase/RNaseH
Name:Reverse transcriptase/RNaseH
Type:PROTEIN
Mol. Mass.:65229.15
Organism:Human immunodeficiency virus 1
Description:ChEMBL_1473730
Residue:566
BDBM50145605
NameBDBM50145605
Synonyms:4-amino-1-[(2R,5S)-5-(hydroxymethyl)tetrahydrofuran-2-yl]pyrimidin-2(1H)-one DDC Dideoxycytidine | ZALCITABINE
TypeSmall organic molecule
Emp. Form.C9H13N3O3
Mol. Mass.211.2178
SMILESNc1ccn([C@H]2CC[C@@H](CO)O2)c(=O)n1