Reaction Details
TargetReverse transcriptase/RNaseH
LigandBDBM50408889
Substrate/Competitorn/a
Meas. Tech.ChEMBL_42166 (CHEMBL655350)
EC50 3300±n/a nM
Citation Pontikis, RDollé, VGuillaumel, JDechaux, ENote, RNguyen, CHLegraverend, MBisagni, EAubertin, AMGrierson, DSMonneret, C Synthesis and evaluation of"AZT-HEPT","AZT-pyridinone", and"ddC-HEPT" conjugates as inhibitors of HIV reverse transcriptase. J Med Chem43:1927-39 (2000) Reverse transcriptase/RNaseH
Name:Reverse transcriptase/RNaseH
Type:PROTEIN
Mol. Mass.:65229.15
Organism:Human immunodeficiency virus 1
Description:ChEMBL_1473730
Residue:566
BDBM50408889
NameBDBM50408889
Synonyms:CHEMBL57161
TypeSmall organic molecule
Emp. Form.C35H47N9O8S
Mol. Mass.753.868
SMILESCCc1c(Sc2cc(C)cc(C)c2)n(CCCCC(=O)NCCCCNC(=O)CCc2cn(C3CC(N=[N+]=[N-])C(CO)O3)c(=O)[nH]c2=O)c(=O)[nH]c1=O