Reaction Details
TargetReverse transcriptase/RNaseH
LigandBDBM50408893
Substrate/Competitorn/a
Meas. Tech.ChEMBL_42166 (CHEMBL655350)
EC50 2800±n/a nM
Citation Pontikis, RDollé, VGuillaumel, JDechaux, ENote, RNguyen, CHLegraverend, MBisagni, EAubertin, AMGrierson, DSMonneret, C Synthesis and evaluation of"AZT-HEPT","AZT-pyridinone", and"ddC-HEPT" conjugates as inhibitors of HIV reverse transcriptase. J Med Chem43:1927-39 (2000) Reverse transcriptase/RNaseH
Name:Reverse transcriptase/RNaseH
Type:PROTEIN
Mol. Mass.:65229.15
Organism:Human immunodeficiency virus 1
Description:ChEMBL_1473730
Residue:566
BDBM50408893
NameBDBM50408893
Synonyms:CHEMBL58914
TypeSmall organic molecule
Emp. Form.C42H61N9O8S
Mol. Mass.852.054
SMILESCCc1c(Sc2cc(C)cc(C)c2)n(CCCCC(=O)NCCCCCCCCCCNC(=O)CCn2c(=O)c(C)cn(C3CC(N=[N+]=[N-])C(CO)O3)c2=O)c(=O)[nH]c1=O