Reaction Details
TargetReverse transcriptase/RNaseH
LigandBDBM50408901
Substrate/Competitorn/a
Meas. Tech.ChEMBL_42166 (CHEMBL655350)
EC50>10000±n/a nM
Citation Pontikis, RDollé, VGuillaumel, JDechaux, ENote, RNguyen, CHLegraverend, MBisagni, EAubertin, AMGrierson, DSMonneret, C Synthesis and evaluation of"AZT-HEPT","AZT-pyridinone", and"ddC-HEPT" conjugates as inhibitors of HIV reverse transcriptase. J Med Chem43:1927-39 (2000) Reverse transcriptase/RNaseH
Name:Reverse transcriptase/RNaseH
Type:PROTEIN
Mol. Mass.:65229.15
Organism:Human immunodeficiency virus 1
Description:ChEMBL_1473730
Residue:566
BDBM50408901
NameBDBM50408901
Synonyms:CHEMBL60873
TypeSmall organic molecule
Emp. Form.C28H40N2O4
Mol. Mass.468.6282
SMILESCCc1c(C)[nH]c(=O)c(NC(=O)CCCCCCCCC(=O)OC)c1Cc1cc(C)cc(C)c1