Reaction Details
TargetGag-Pol polyprotein [489-587]
LigandBDBM50005367
Substrate/Competitorn/a
Meas. Tech.ChEMBL_158030 (CHEMBL768621)
IC50 5.4±n/a nM
Citation Vieth, MCummins, DJ DoMCoSAR: a novel approach for establishing the docking mode that is consistent with the structure-activity relationship. Application to HIV-1 protease inhibitors and VEGF receptor tyrosine kinase inhibitors. J Med Chem43:3020-32 (2000) Gag-Pol polyprotein [489-587]
Name:Gag-Pol polyprotein [489-587]
Type:Enzyme Subunit
Mol. Mass.:10781.16
Organism:Human immunodeficiency virus type 1
Description:P04585[489-587]
Residue:99
BDBM50005367
NameBDBM50005367
Synonyms:CHEMBL318319
TypeSmall organic molecule
Emp. Form.C34H40N2O6
Mol. Mass.572.6912
SMILES[H][C@](O)(C[C@@]([H])(CC(=O)c1ccccc1)C(=O)N[C@]1([H])c2ccccc2C[C@@]1([H])O)[C@]([H])(Cc1ccccc1)NC(=O)OC(C)(C)C