Reaction Details
TargetVascular endothelial growth factor receptor 2
LigandBDBM50065297
Substrate/Competitorn/a
Meas. Tech.ChEMBL_213949 (CHEMBL811927)
IC50 5248±n/a nM
Citation Vieth, MCummins, DJ DoMCoSAR: a novel approach for establishing the docking mode that is consistent with the structure-activity relationship. Application to HIV-1 protease inhibitors and VEGF receptor tyrosine kinase inhibitors. J Med Chem43:3020-32 (2000) Vascular endothelial growth factor receptor 2
Name:Vascular endothelial growth factor receptor 2
Type:PROTEIN
Mol. Mass.:152506.58
Organism:Mus musculus
Description:ChEMBL_1469997
Residue:1367
BDBM50065297
NameBDBM50065297
Synonyms:3-(4-Isopropyl-benzylidene)-1,3-dihydro-indol-2-one CHEMBL48760
TypeSmall organic molecule
Emp. Form.C18H17NO
Mol. Mass.263.3337
SMILESCC(C)c1ccc(\C=C2\C(=O)Nc3ccccc23)cc1