Reaction Details
TargetIntegrin alpha-V/beta-3
LigandBDBM50092509
Substrate/Competitorn/a
Meas. Tech.ChEMBL_216952 (CHEMBL822770)
IC50 0.44±n/a nM
Citation Duggan, MEDuong, LTFisher, JEHamill, TGHoffman, WFHuff, JRIhle, NCLeu, CTNagy, RMPerkins, JJRodan, SBWesolowski, GWhitman, DBZartman, AERodan, GAHartman, GD Nonpeptide alpha(v)beta(3) antagonists. 1. Transformation of a potent, integrin-selective alpha(IIb)beta(3) antagonist into a potent alpha(v)beta(3) antagonist. J Med Chem43:3736-45 (2000) Integrin alpha-V/beta-3
Name:Integrin alpha-V/beta-3
Type:Enzyme
Mol. Mass.:n/a
Description:n/a
Components:This complex has 2 components.
Component 1
Name:Integrin alpha-V
Synonyms:ITAV_HUMAN Integrin alpha-V/alpha-5 VNRA Vitronectin receptor | Vitronectin receptor subunit alpha
Type:PROTEIN
Mol. Mass.:116024.92
Organism:Homo sapiens (Human)
Description:ChEMBL_582336
Residue:1048
Component 2
Name:Integrin beta-3
Synonyms:CD_antigen=CD61 GPIIIa ITGB3 Platelet membrane glycoprotein IIIa
Type:Protein
Mol. Mass.:87038.91
Organism:Homo sapiens (Human)
Description:P05106
Residue:788
BDBM50092509
NameBDBM50092509
Synonyms:(S)-3-{4-[2-(6-Amino-pyridin-2-yl)-ethyl]-benzoylamino}-2-benzenesulfonylamino-propionic acid CHEMBL123374
TypeSmall organic molecule
Emp. Form.C23H24N4O5S
Mol. Mass.468.525
SMILESNc1cccc(CCc2ccc(cc2)C(=O)NC[C@H](NS(=O)(=O)c2ccccc2)C(O)=O)n1