Reaction Details
TargetAmine oxidase [flavin-containing] A
LigandBDBM50378564
Substrate/Competitorn/a
Meas. Tech.ChEMBL_123580 (CHEMBL732300)
IC50 6760.83±n/a nM
Citation Gnerre, CCatto, MLeonetti, FWeber, PCarrupt, PAAltomare, CCarotti, ATesta, B Inhibition of monoamine oxidases by functionalized coumarin derivatives: biological activities, QSARs, and 3D-QSARs. J Med Chem43:4747-58 (2000) Amine oxidase [flavin-containing] A
Name:Amine oxidase [flavin-containing] A
Type:Enzyme
Mol. Mass.:59515.21
Organism:Rattus norvegicus (rat)
Description:n/a
Residue:526
BDBM50378564
NameBDBM50378564
Synonyms:CHEMBL145781
TypeSmall organic molecule
Emp. Form.C16H12O3
Mol. Mass.252.2647
SMILESO=c1ccc2ccc(OCc3ccccc3)cc2o1