Reaction Details
TargetAmine oxidase [flavin-containing] B
LigandBDBM50409097
Substrate/Competitorn/a
Meas. Tech.ChEMBL_124418 (CHEMBL733082)
IC50 2.82±n/a nM
Citation Gnerre, CCatto, MLeonetti, FWeber, PCarrupt, PAAltomare, CCarotti, ATesta, B Inhibition of monoamine oxidases by functionalized coumarin derivatives: biological activities, QSARs, and 3D-QSARs. J Med Chem43:4747-58 (2000) Amine oxidase [flavin-containing] B
Name:Amine oxidase [flavin-containing] B
Type:Enzyme
Mol. Mass.:58469.65
Organism:Rattus norvegicus (rat)
Description:P19643
Residue:520
BDBM50409097
NameBDBM50409097
Synonyms:CHEMBL108697
TypeSmall organic molecule
Emp. Form.C18H15FO3
Mol. Mass.298.3083
SMILESCc1c(C)c(=O)oc2cc(OCc3cccc(F)c3)ccc12