Reaction Details
TargetAmine oxidase [flavin-containing] B
LigandBDBM50409099
Substrate/Competitorn/a
Meas. Tech.ChEMBL_124418 (CHEMBL733082)
IC50 2.57±n/a nM
Citation Gnerre, CCatto, MLeonetti, FWeber, PCarrupt, PAAltomare, CCarotti, ATesta, B Inhibition of monoamine oxidases by functionalized coumarin derivatives: biological activities, QSARs, and 3D-QSARs. J Med Chem43:4747-58 (2000) Amine oxidase [flavin-containing] B
Name:Amine oxidase [flavin-containing] B
Type:Enzyme
Mol. Mass.:58469.65
Organism:Rattus norvegicus (rat)
Description:P19643
Residue:520
BDBM50409099
NameBDBM50409099
Synonyms:CHEMBL356977
TypeSmall organic molecule
Emp. Form.C18H15NO5
Mol. Mass.325.3154
SMILESCc1c(C)c(=O)oc2cc(OCc3cccc(c3)[N+]([O-])=O)ccc12