Reaction Details
TargetHLA class I histocompatibility antigen, A alpha chain
LigandBDBM50409406
Substrate/Competitorn/a
Meas. Tech.ChEMBL_47858 (CHEMBL660105)
IC50 27.99±n/a nM
Citation Doytchinova, IAFlower, DR Toward the quantitative prediction of T-cell epitopes: coMFA and coMSIA studies of peptides with affinity for the class I MHC molecule HLA-A*0201. J Med Chem44:3572-81 (2001) HLA class I histocompatibility antigen, A alpha chain
Name:HLA class I histocompatibility antigen, A alpha chain
Type:PROTEIN
Mol. Mass.:40836.72
Organism:Homo sapiens (Human)
Description:ChEMBL_47858
Residue:365
BDBM50409406
NameBDBM50409406
Synonyms:CHEMBL118999
TypeSmall organic molecule
Emp. Form.C41H75N9O11S
Mol. Mass.902.153
SMILESCSCC[C@H](NC(=O)[C@@H](N)C(C)C)C(=O)NCC(=O)N[C@@H]([C@@H](C)O)C(=O)N[C@@H](CC(C)C)C(=O)N[C@@H](C(C)C)C(=O)N[C@@H](C)C(=O)N[C@@H](CC(C)C)C(=O)N[C@@H](C(C)C)C(O)=O