Reaction Details
TargetBeta-3 adrenergic receptor
LigandBDBM50409469
Substrate/Competitorn/a
Meas. Tech.ChEMBL_218265 (CHEMBL819430)
EC50 61.66±n/a nM
Citation Tanaka, NTamai, TMukaiyama, HHirabayashi, AMuranaka, HAkahane, SMiyata, HAkahane, M Discovery of novel N-phenylglycine derivatives as potent and selective beta(3)-adrenoceptor agonists for the treatment of frequent urination and urinary incontinence. J Med Chem44:1436-45 (2001) Beta-3 adrenergic receptor
Name:Beta-3 adrenergic receptor
Type:PROTEIN
Mol. Mass.:43161.83
Organism:Rattus norvegicus
Description:ChEMBL_1509452
Residue:400
BDBM50409469
NameBDBM50409469
Synonyms:CHEMBL284520
TypeSmall organic molecule
Emp. Form.C19H22Cl2N2O4
Mol. Mass.413.295
SMILESC[C@H](NCCc1cc(Cl)c(NCC(O)=O)cc1Cl)[C@H](O)c1ccc(O)cc1