Reaction Details
TargetBeta-2 adrenergic receptor
LigandBDBM50002134
Substrate/Competitorn/a
Meas. Tech.ChEMBL_218263 (CHEMBL819428)
IC50 9772.37±n/a nM
Citation Tanaka, NTamai, TMukaiyama, HHirabayashi, AMuranaka, HAkahane, SMiyata, HAkahane, M Discovery of novel N-phenylglycine derivatives as potent and selective beta(3)-adrenoceptor agonists for the treatment of frequent urination and urinary incontinence. J Med Chem44:1436-45 (2001) Beta-2 adrenergic receptor
Name:Beta-2 adrenergic receptor
Type:PROTEIN
Mol. Mass.:46896.26
Organism:Rattus norvegicus
Description:ChEMBL_38603
Residue:418
BDBM50002134
NameBDBM50002134
Synonyms:5-((2R)-2-{[(2R)-2-(3-chlorophenyl)-2-hydroxyethyl]amino}propyl)-1,3-benzodioxole-2,2-dicarboxylate 5-{2-[2-(3-Chloro-phenyl)-2-hydroxy-ethylamino]-propyl}-benzo[1,3]dioxole-2,2-dicarboxylic acid;Disodium salt CL-316243 disodium 5-((2R)-2-{[(2R)-2-(3-chlorophenyl)-2-hydroxyethyl]amino}propyl)-1,3-benzodioxole-2,2-dicarboxylate | disodium 5-[2-[2-(3-chlorophenyl)-2-hydroxyethylamino]-(2R)-propyl]benzo[d][1,3]dioxole-2,2-dicarboxylate(CL 316,243)
TypeSmall organic molecule
Emp. Form.C20H18ClNO7
Mol. Mass.419.814
SMILESC[C@H](Cc1ccc2OC(Oc2c1)(C([O-])=O)C([O-])=O)NC[C@H](O)c1cccc(Cl)c1