Reaction Details
TargetGamma-aminobutyric acid receptor subunit alpha-1/beta-2/gamma-2
LigandBDBM26187
Substrate/Competitorn/a
Meas. Tech.ChEMBL_69814 (CHEMBL678911)
EC50 1000000±n/a nM
Citation Krasowski, MDHong, XHopfinger, AJHarrison, NL 4D-QSAR analysis of a set of propofol analogues: mapping binding sites for an anesthetic phenol on the GABA(A) receptor. J Med Chem45:3210-21 (2002) Gamma-aminobutyric acid receptor subunit alpha-1/beta-2/gamma-2
Name:Gamma-aminobutyric acid receptor subunit alpha-1/beta-2/gamma-2
Type:Protein
Mol. Mass.:n/a
Description:n/a
Components:This complex has 3 components.
Component 1
Name:Gamma-aminobutyric acid receptor subunit alpha-1
Synonyms:Benzodiazepine central GABA A Benzodiazepine liver GABA(A) receptor subunit alpha-1 GABA-A receptor GBRA1_HUMAN TBPS | agonist GABA site
Type:Protein
Mol. Mass.:51817.35
Organism:Homo sapiens (Human)
Description:P14867
Residue:456
Component 2
Name:Gamma-aminobutyric acid receptor subunit beta-2
Synonyms:GABA(A) receptor subunit beta-2 GBRB2_HUMAN
Type:PROTEIN
Mol. Mass.:59167.91
Organism:Homo sapiens (Human)
Description:EBI_221
Residue:512
Component 3
Name:Gamma-aminobutyric acid receptor subunit gamma-2
Synonyms:GABA(A) receptor subunit gamma-2 GBRG2_HUMAN
Type:PROTEIN
Mol. Mass.:54172.74
Organism:Homo sapiens (Human)
Description:EBI_217
Residue:467
BDBM26187
NameBDBM26187
Synonyms:α-CA inhibitor, 11 US9688816, 2 | phenol
TypeSmall organic molecule
Emp. Form.C6H6O
Mol. Mass.94.1112
SMILESOc1ccccc1