Reaction Details
TargetReverse transcriptase/RNaseH
LigandBDBM50169035
Substrate/Competitorn/a
Meas. Tech.ChEMBL_78584 (CHEMBL686035)
EC50 50±n/a nM
Citation Lobatón, ERodríguez-Barrios, FGago, FPérez-Pérez, MJDe Clercq, EBalzarini, JCamarasa, MJVelázquez, S Synthesis of 3' '-substituted TSAO derivatives with anti-HIV-1 and anti-HIV-2 activity through an efficient palladium-catalyzed cross-coupling approach. J Med Chem45:3934-45 (2002) Reverse transcriptase/RNaseH
Name:Reverse transcriptase/RNaseH
Type:PROTEIN
Mol. Mass.:65229.15
Organism:Human immunodeficiency virus 1
Description:ChEMBL_1473730
Residue:566
BDBM50169035
NameBDBM50169035
Synonyms:1-[(5R,6R,8R,9R)-4-amino-9-(tert-butyl-dimethyl-silanyloxy)-6-(tert-butyl-dimethyl-silanyloxymethyl)-2,2-dioxo-1,7-dioxa-2lambda*6*-thia-spiro[4.4]non-3-en-8-yl]-5-methyl-1H-pyrimidine-2,4-dione [2',5'-bis-O-(tert-butyldimethylsilyl)-b-D-ribofuranosyl]-3'-spiro-5''-(4''-amino-1'',2''-oxathiole-2'',2''-dioxide)thymine | [2',5'-bis-O-(tert-butyldimethylsilyl)-beta-D-ribofuranosyl]-3'-spiro-5''-(4''-amino-1', 2'-oxathiole-2',2'-dioxide)thymine
TypeSmall organic molecule
Emp. Form.C24H43N3O8SSi2
Mol. Mass.589.85
SMILESCc1cn([C@@H]2O[C@H](CO[Si](C)(C)C(C)(C)C)[C@@]3(OS(=O)(=O)C=C3N)[C@H]2O[Si](C)(C)C(C)(C)C)c(=O)[nH]c1=O