Reaction Details
TargetReverse transcriptase/RNaseH
LigandBDBM50409560
Substrate/Competitorn/a
Meas. Tech.ChEMBL_78584 (CHEMBL686035)
EC50 15000±n/a nM
Citation Lobatón, ERodríguez-Barrios, FGago, FPérez-Pérez, MJDe Clercq, EBalzarini, JCamarasa, MJVelázquez, S Synthesis of 3' '-substituted TSAO derivatives with anti-HIV-1 and anti-HIV-2 activity through an efficient palladium-catalyzed cross-coupling approach. J Med Chem45:3934-45 (2002) Reverse transcriptase/RNaseH
Name:Reverse transcriptase/RNaseH
Type:PROTEIN
Mol. Mass.:65229.15
Organism:Human immunodeficiency virus 1
Description:ChEMBL_1473730
Residue:566
BDBM50409560
NameBDBM50409560
Synonyms:CHEMBL127065
TypeSmall organic molecule
Emp. Form.C20H31N3O8SSi
Mol. Mass.501.626
SMILESCC=C1C(=N)C2(OS1(=O)=O)C(CO)OC(C2O[Si](C)(C)C(C)(C)C)n1cc(C)c(=O)[nH]c1=O