Reaction Details
TargetReverse transcriptase/RNaseH
LigandBDBM50409568
Substrate/Competitorn/a
Meas. Tech.ChEMBL_78584 (CHEMBL686035)
EC50 50±n/a nM
Citation Lobatón, ERodríguez-Barrios, FGago, FPérez-Pérez, MJDe Clercq, EBalzarini, JCamarasa, MJVelázquez, S Synthesis of 3' '-substituted TSAO derivatives with anti-HIV-1 and anti-HIV-2 activity through an efficient palladium-catalyzed cross-coupling approach. J Med Chem45:3934-45 (2002) Reverse transcriptase/RNaseH
Name:Reverse transcriptase/RNaseH
Type:PROTEIN
Mol. Mass.:65229.15
Organism:Human immunodeficiency virus 1
Description:ChEMBL_1473730
Residue:566
BDBM50409568
NameBDBM50409568
Synonyms:CHEMBL339262
TypeSmall organic molecule
Emp. Form.C25H44IN3O8SSi2
Mol. Mass.729.773
SMILESCc1cn(C2OC(CO[Si](C)(C)C(C)(C)C)C3(OS(=O)(=O)C(I)=C3N)C2O[Si](C)(C)C(C)(C)C)c(=O)n(C)c1=O