Reaction Details
TargetReverse transcriptase/RNaseH
LigandBDBM50004536
Substrate/Competitorn/a
Meas. Tech.ChEMBL_78585 (CHEMBL686036)
EC50 60±n/a nM
Citation Lobatón, ERodríguez-Barrios, FGago, FPérez-Pérez, MJDe Clercq, EBalzarini, JCamarasa, MJVelázquez, S Synthesis of 3' '-substituted TSAO derivatives with anti-HIV-1 and anti-HIV-2 activity through an efficient palladium-catalyzed cross-coupling approach. J Med Chem45:3934-45 (2002) Reverse transcriptase/RNaseH
Name:Reverse transcriptase/RNaseH
Type:PROTEIN
Mol. Mass.:65229.15
Organism:Human immunodeficiency virus 1
Description:ChEMBL_1473730
Residue:566
BDBM50004536
NameBDBM50004536
Synonyms:1-[4-Amino-9-(tert-butyl-dimethyl-silanyloxy)-6-(tert-butyl-dimethyl-silanyloxymethyl)-2,2-dioxo-1,7-dioxa-2lambda*6*-thia-spiro[4.4]non-3-en-8-yl]-3,5-dimethyl-1H-pyrimidine-2,4-dione CHEMBL55745
TypeSmall organic molecule
Emp. Form.C25H45N3O8SSi2
Mol. Mass.603.876
SMILESCc1cn(C2OC(CO[Si](C)(C)C(C)(C)C)C3(OS(=O)(=O)C=C3N)C2O[Si](C)(C)C(C)(C)C)c(=O)n(C)c1=O