Reaction Details
TargetCocaine esterase
LigandBDBM50409657
Substrate/Competitorn/a
Meas. Tech.ChEMBL_45459 (CHEMBL657981)
IC50 32.36±n/a nM
Citation Wheelock, CEColvin, MEUemura, IOlmstead, MMSanborn, JRNakagawa, YJones, ADHammock, BD Use of ab initio calculations to predict the biological potency of carboxylesterase inhibitors. J Med Chem45:5576-93 (2002) Cocaine esterase
Name:Cocaine esterase
Type:PROTEIN
Mol. Mass.:61801.08
Organism:Homo sapiens (Human)
Description:ChEMBL_1494240
Residue:559
BDBM50409657
NameBDBM50409657
Synonyms:CHEMBL153015
TypeSmall organic molecule
Emp. Form.C10H15F5O
Mol. Mass.246.2175
SMILESCCCCCCCC(F)(F)C(=O)C(F)(F)F