Reaction Details
TargetCarboxylic ester hydrolase
LigandBDBM50409659
Substrate/Competitorn/a
Meas. Tech.ChEMBL_92659 (CHEMBL877911)
IC50 489778.82±n/a nM
Citation Wheelock, CEColvin, MEUemura, IOlmstead, MMSanborn, JRNakagawa, YJones, ADHammock, BD Use of ab initio calculations to predict the biological potency of carboxylesterase inhibitors. J Med Chem45:5576-93 (2002) Carboxylic ester hydrolase
Name:Carboxylic ester hydrolase
Synonyms:CG8425-PA [Drosophila melanogaster]
Type:PROTEIN
Mol. Mass.:64506.23
Organism:Drosophila melanogaster
Description:ChEMBL_92659
Residue:579
BDBM50409659
NameBDBM50409659
Synonyms:CHEMBL153556
TypeSmall organic molecule
Emp. Form.C9H18O2
Mol. Mass.158.238
SMILESCCCCCCOCC(C)=O