Reaction Details
TargetCocaine esterase
LigandBDBM50409662
Substrate/Competitorn/a
Meas. Tech.ChEMBL_45459 (CHEMBL657981)
IC50 5011.87±n/a nM
Citation Wheelock, CEColvin, MEUemura, IOlmstead, MMSanborn, JRNakagawa, YJones, ADHammock, BD Use of ab initio calculations to predict the biological potency of carboxylesterase inhibitors. J Med Chem45:5576-93 (2002) Cocaine esterase
Name:Cocaine esterase
Type:PROTEIN
Mol. Mass.:61801.08
Organism:Homo sapiens (Human)
Description:ChEMBL_1494240
Residue:559
BDBM50409662
NameBDBM50409662
Synonyms:CHEMBL152698
TypeSmall organic molecule
Emp. Form.C10H18F2O
Mol. Mass.192.2461
SMILESCCCCCCCCC(=O)C(F)F