Reaction Details
TargetAcylcarnitine hydrolase
LigandBDBM50371962
Substrate/Competitorn/a
Meas. Tech.ChEMBL_216226 (CHEMBL823860)
IC50 446.68±n/a nM
Citation Wheelock, CEColvin, MEUemura, IOlmstead, MMSanborn, JRNakagawa, YJones, ADHammock, BD Use of ab initio calculations to predict the biological potency of carboxylesterase inhibitors. J Med Chem45:5576-93 (2002) Acylcarnitine hydrolase
Name:Acylcarnitine hydrolase
Type:PROTEIN
Mol. Mass.:62457.35
Organism:Mus musculus
Description:ChEMBL_216226
Residue:561
BDBM50371962
NameBDBM50371962
Synonyms:CHEMBL155396
TypeSmall organic molecule
Emp. Form.C9H15F3O2S
Mol. Mass.244.274
SMILESCCCCCCS(=O)CC(=O)C(F)(F)F