Reaction Details
TargetCarboxylic ester hydrolase
LigandBDBM50409667
Substrate/Competitorn/a
Meas. Tech.ChEMBL_92659 (CHEMBL877911)
IC50 69183.1±n/a nM
Citation Wheelock, CEColvin, MEUemura, IOlmstead, MMSanborn, JRNakagawa, YJones, ADHammock, BD Use of ab initio calculations to predict the biological potency of carboxylesterase inhibitors. J Med Chem45:5576-93 (2002) Carboxylic ester hydrolase
Name:Carboxylic ester hydrolase
Synonyms:CG8425-PA [Drosophila melanogaster]
Type:PROTEIN
Mol. Mass.:64506.23
Organism:Drosophila melanogaster
Description:ChEMBL_92659
Residue:579
BDBM50409667
NameBDBM50409667
Synonyms:CHEMBL152376
TypeSmall organic molecule
Emp. Form.C9H18O3Se
Mol. Mass.253.2
SMILESCCCCCC[Se](=O)(=O)CC(C)=O