Reaction Details
TargetReceptor tyrosine-protein kinase erbB-2
LigandBDBM4303
Substrate/Competitorn/a
Meas. Tech.ChEMBL_161600 (CHEMBL769140)
IC50 34673.69±n/a nM
Citation Kamath, SBuolamwini, JK Receptor-guided alignment-based comparative 3D-QSAR studies of benzylidene malonitrile tyrphostins as EGFR and HER-2 kinase inhibitors. J Med Chem46:4657-68 (2003) 
 
Receptor tyrosine-protein kinase erbB-2
Name:Receptor tyrosine-protein kinase erbB-2
Type:n/a
Mol. Mass.:137894.47
Organism:Homo sapiens (Human)
Description:P04626
Residue:1255
BDBM4303
NameBDBM4303
Synonyms:(2E)-2-cyano-3-(3,4-dihydroxyphenyl)-N-(3-phenylpropyl)prop-2-enamide (E)-2-cyano-3-(3,4-dihydroxyphenyl)-N-(3-phenylpropyl)acrylamide (E)-3-[3,4-bis(oxidanyl)phenyl]-2-cyano-N-(3-phenylpropyl)prop-2-enamide MLS000069704 TYRPHOSTIN AG 555 cid_5328770
TypeSmall organic molecule
Emp. Form.C19H18N2O3
Mol. Mass.322.3578
SMILESOc1ccc(\C=C(/C#N)C(=O)NCCCc2ccccc2)cc1O