Reaction Details
TargetEpidermal growth factor receptor
LigandBDBM50036687
Substrate/Competitorn/a
Meas. Tech.ChEMBL_66876 (CHEMBL676067)
IC50 891.25±n/a nM
Citation Kamath, SBuolamwini, JK Receptor-guided alignment-based comparative 3D-QSAR studies of benzylidene malonitrile tyrphostins as EGFR and HER-2 kinase inhibitors. J Med Chem46:4657-68 (2003) 
 
Epidermal growth factor receptor
Name:Epidermal growth factor receptor
Type:Receptor Kinase Domain
Mol. Mass.:134279.59
Organism:Homo sapiens (Human)
Description:P00533
Residue:1210
BDBM50036687
NameBDBM50036687
Synonyms:(E)-3-(3-Benzylsulfanylmethyl-4-hydroxy-5-methoxy-phenyl)-2-cyano-acrylamide CHEMBL326318
TypeSmall organic molecule
Emp. Form.C19H18N2O3S
Mol. Mass.354.423
SMILESCOc1cc(\C=C(/C#N)C(N)=O)cc(CSCc2ccccc2)c1O