Reaction Details
TargetReceptor tyrosine-protein kinase erbB-2
LigandBDBM50409734
Substrate/Competitorn/a
Meas. Tech.ChEMBL_161600 (CHEMBL769140)
IC50 15848.93±n/a nM
Citation Kamath, SBuolamwini, JK Receptor-guided alignment-based comparative 3D-QSAR studies of benzylidene malonitrile tyrphostins as EGFR and HER-2 kinase inhibitors. J Med Chem46:4657-68 (2003) 
 
Receptor tyrosine-protein kinase erbB-2
Name:Receptor tyrosine-protein kinase erbB-2
Type:n/a
Mol. Mass.:137894.47
Organism:Homo sapiens (Human)
Description:P04626
Residue:1255
BDBM50409734
NameBDBM50409734
Synonyms:CHEMBL1161234
TypeSmall organic molecule
Emp. Form.C15H16N2O5S
Mol. Mass.336.363
SMILESCOc1cc(\C=C(/C#N)C(N)=O)cc(SCCCC(O)=O)c1O