Reaction Details
TargetReceptor tyrosine-protein kinase erbB-2
LigandBDBM50036700
Substrate/Competitorn/a
Meas. Tech.ChEMBL_161600 (CHEMBL769140)
IC50 1513.56±n/a nM
Citation Kamath, SBuolamwini, JK Receptor-guided alignment-based comparative 3D-QSAR studies of benzylidene malonitrile tyrphostins as EGFR and HER-2 kinase inhibitors. J Med Chem46:4657-68 (2003) 
 
Receptor tyrosine-protein kinase erbB-2
Name:Receptor tyrosine-protein kinase erbB-2
Type:n/a
Mol. Mass.:137894.47
Organism:Homo sapiens (Human)
Description:P04626
Residue:1255
BDBM50036700
NameBDBM50036700
Synonyms:(E)-3-[3-(Benzooxazol-2-ylsulfanylmethyl)-4-hydroxy-5-methoxy-phenyl]-2-cyano-acrylamide CHEMBL118205
TypeSmall organic molecule
Emp. Form.C19H15N3O4S
Mol. Mass.381.405
SMILESCOc1cc(\C=C(/C#N)C(N)=O)cc(CSc2nc3ccccc3o2)c1O