Reaction Details
TargetEpidermal growth factor receptor
LigandBDBM50036680
Substrate/Competitorn/a
Meas. Tech.ChEMBL_66876 (CHEMBL676067)
IC50 1737.8±n/a nM
Citation Kamath, SBuolamwini, JK Receptor-guided alignment-based comparative 3D-QSAR studies of benzylidene malonitrile tyrphostins as EGFR and HER-2 kinase inhibitors. J Med Chem46:4657-68 (2003) 
 
Epidermal growth factor receptor
Name:Epidermal growth factor receptor
Type:Receptor Kinase Domain
Mol. Mass.:134279.59
Organism:Homo sapiens (Human)
Description:P00533
Residue:1210
BDBM50036680
NameBDBM50036680
Synonyms:(E)-2-Cyano-3-(4-hydroxy-3-methoxy-5-p-tolylsulfanylmethyl-phenyl)-acrylamide CHEMBL333454
TypeSmall organic molecule
Emp. Form.C19H18N2O3S
Mol. Mass.354.423
SMILESCOc1cc(\C=C(/C#N)C(N)=O)cc(CSc2ccc(C)cc2)c1O