Reaction Details
TargetReceptor tyrosine-protein kinase erbB-2
LigandBDBM4298
Substrate/Competitorn/a
Meas. Tech.ChEMBL_161600 (CHEMBL769140)
IC50 3019.95±n/a nM
Citation Kamath, SBuolamwini, JK Receptor-guided alignment-based comparative 3D-QSAR studies of benzylidene malonitrile tyrphostins as EGFR and HER-2 kinase inhibitors. J Med Chem46:4657-68 (2003) 
 
Receptor tyrosine-protein kinase erbB-2
Name:Receptor tyrosine-protein kinase erbB-2
Type:n/a
Mol. Mass.:137894.47
Organism:Homo sapiens (Human)
Description:P04626
Residue:1255
BDBM4298
NameBDBM4298
Synonyms:(2E)-3-(3,4-dihydroxyphenyl)-2-[(4-nitrophenyl)carbonyl]prop-2-enenitrile | Tyrphostin deriv. 33
TypeSmall organic molecule
Emp. Form.C16H10N2O5
Mol. Mass.310.261
SMILESOc1ccc(\C=C(/C#N)C(=O)c2ccc(cc2)[N+]([O-])=O)cc1O