Reaction Details
TargetReceptor tyrosine-protein kinase erbB-2
LigandBDBM4313
Substrate/Competitorn/a
Meas. Tech.ChEMBL_161600 (CHEMBL769140)
IC50 13489.63±n/a nM
Citation Kamath, SBuolamwini, JK Receptor-guided alignment-based comparative 3D-QSAR studies of benzylidene malonitrile tyrphostins as EGFR and HER-2 kinase inhibitors. J Med Chem46:4657-68 (2003) 
 
Receptor tyrosine-protein kinase erbB-2
Name:Receptor tyrosine-protein kinase erbB-2
Type:n/a
Mol. Mass.:137894.47
Organism:Homo sapiens (Human)
Description:P04626
Residue:1255
BDBM4313
NameBDBM4313
Synonyms:(2E)-N-benzyl-2-cyano-3-(3,4-dihydroxyphenyl)prop-2-enamide AG-490 Tyrphostin AG 490 Tyrphostin deriv. 42
TypeSmall organic molecule
Emp. Form.C17H14N2O3
Mol. Mass.294.3047
SMILESOc1ccc(\C=C(/C#N)C(=O)NCc2ccccc2)cc1O