Reaction Details
TargetReceptor tyrosine-protein kinase erbB-2
LigandBDBM50036679
Substrate/Competitorn/a
Meas. Tech.ChEMBL_161600 (CHEMBL769140)
IC50 707.95±n/a nM
Citation Kamath, SBuolamwini, JK Receptor-guided alignment-based comparative 3D-QSAR studies of benzylidene malonitrile tyrphostins as EGFR and HER-2 kinase inhibitors. J Med Chem46:4657-68 (2003) 
 
Receptor tyrosine-protein kinase erbB-2
Name:Receptor tyrosine-protein kinase erbB-2
Type:n/a
Mol. Mass.:137894.47
Organism:Homo sapiens (Human)
Description:P04626
Residue:1255
BDBM50036679
NameBDBM50036679
Synonyms:(E)-2-Cyano-3-[4-hydroxy-3-methoxy-5-(pyridin-2-ylsulfanylmethyl)-phenyl]-acrylamide CHEMBL119156
TypeSmall organic molecule
Emp. Form.C17H15N3O3S
Mol. Mass.341.384
SMILESCOc1cc(\C=C(/C#N)C(N)=O)cc(CSc2ccccn2)c1O