Reaction Details
TargetReceptor tyrosine-protein kinase erbB-2
LigandBDBM4309
Substrate/Competitorn/a
Meas. Tech.ChEMBL_161600 (CHEMBL769140)
IC50 331131.12±n/a nM
Citation Kamath, SBuolamwini, JK Receptor-guided alignment-based comparative 3D-QSAR studies of benzylidene malonitrile tyrphostins as EGFR and HER-2 kinase inhibitors. J Med Chem46:4657-68 (2003) 
 
Receptor tyrosine-protein kinase erbB-2
Name:Receptor tyrosine-protein kinase erbB-2
Type:n/a
Mol. Mass.:137894.47
Organism:Homo sapiens (Human)
Description:P04626
Residue:1255
BDBM4309
NameBDBM4309
Synonyms:Tyrphostin deriv. 58 | ethyl 2-[(2E)-2-cyano-3-(3,4-dihydroxyphenyl)prop-2-enamido]-3-phenylpropanoate
TypeSmall organic molecule
Emp. Form.C21H20N2O5
Mol. Mass.380.3939
SMILESCCOC(=O)C(Cc1ccccc1)NC(=O)C(=C\c1ccc(O)c(O)c1)\C#N