Reaction Details
TargetReceptor tyrosine-protein kinase erbB-2
LigandBDBM50409735
Substrate/Competitorn/a
Meas. Tech.ChEMBL_161600 (CHEMBL769140)
IC50 4570.88±n/a nM
Citation Kamath, SBuolamwini, JK Receptor-guided alignment-based comparative 3D-QSAR studies of benzylidene malonitrile tyrphostins as EGFR and HER-2 kinase inhibitors. J Med Chem46:4657-68 (2003) 
 
Receptor tyrosine-protein kinase erbB-2
Name:Receptor tyrosine-protein kinase erbB-2
Type:n/a
Mol. Mass.:137894.47
Organism:Homo sapiens (Human)
Description:P04626
Residue:1255
BDBM50409735
NameBDBM50409735
Synonyms:CHEMBL143212
TypeSmall organic molecule
Emp. Form.C22H18N2O3S
Mol. Mass.390.455
SMILESCOc1cc(\C=C(/C#N)C(N)=O)cc(CSc2cccc3ccccc23)c1O