Reaction Details
TargetEpidermal growth factor receptor
LigandBDBM4308
Substrate/Competitorn/a
Meas. Tech.ChEMBL_66876 (CHEMBL676067)
IC50 5011.87±n/a nM
Citation Kamath, SBuolamwini, JK Receptor-guided alignment-based comparative 3D-QSAR studies of benzylidene malonitrile tyrphostins as EGFR and HER-2 kinase inhibitors. J Med Chem46:4657-68 (2003) 
 
Epidermal growth factor receptor
Name:Epidermal growth factor receptor
Type:Receptor Kinase Domain
Mol. Mass.:134279.59
Organism:Homo sapiens (Human)
Description:P00533
Residue:1210
BDBM4308
NameBDBM4308
Synonyms:(2E)-2-cyano-3-(3,4-dihydroxyphenyl)-N-(4-phenylbutyl)prop-2-enamide Tyrphostin deriv. 56
TypeSmall organic molecule
Emp. Form.C20H20N2O3
Mol. Mass.336.3844
SMILESOc1ccc(\C=C(/C#N)C(=O)NCCCCc2ccccc2)cc1O