Reaction Details
TargetReceptor tyrosine-protein kinase erbB-2
LigandBDBM50036699
Substrate/Competitorn/a
Meas. Tech.ChEMBL_161600 (CHEMBL769140)
IC50 112201.85±n/a nM
Citation Kamath, SBuolamwini, JK Receptor-guided alignment-based comparative 3D-QSAR studies of benzylidene malonitrile tyrphostins as EGFR and HER-2 kinase inhibitors. J Med Chem46:4657-68 (2003) 
 
Receptor tyrosine-protein kinase erbB-2
Name:Receptor tyrosine-protein kinase erbB-2
Type:n/a
Mol. Mass.:137894.47
Organism:Homo sapiens (Human)
Description:P04626
Residue:1255
BDBM50036699
NameBDBM50036699
Synonyms:2-(4-Hydroxy-3-methoxy-5-methyl-benzylidene)-malononitrile | CHEMBL120564
TypeSmall organic molecule
Emp. Form.C12H10N2O2
Mol. Mass.214.22
SMILES[#6]-[#8]-c1cc(\[#6]=[#6](/C#N)C#N)cc(-[#6])c1-[#8]