Reaction Details
TargetReceptor tyrosine-protein kinase erbB-2
LigandBDBM50036702
Substrate/Competitorn/a
Meas. Tech.ChEMBL_161600 (CHEMBL769140)
IC50 3311.31±n/a nM
Citation Kamath, SBuolamwini, JK Receptor-guided alignment-based comparative 3D-QSAR studies of benzylidene malonitrile tyrphostins as EGFR and HER-2 kinase inhibitors. J Med Chem46:4657-68 (2003) 
 
Receptor tyrosine-protein kinase erbB-2
Name:Receptor tyrosine-protein kinase erbB-2
Type:n/a
Mol. Mass.:137894.47
Organism:Homo sapiens (Human)
Description:P04626
Residue:1255
BDBM50036702
NameBDBM50036702
Synonyms:(E)-3-[3-(2-Acetylamino-phenylsulfanylmethyl)-4-hydroxy-5-methoxy-phenyl]-2-cyano-acrylamide CHEMBL115895
TypeSmall organic molecule
Emp. Form.C20H19N3O4S
Mol. Mass.397.448
SMILESCOc1cc(\C=C(/C#N)C(N)=O)cc(CSc2ccccc2NC(C)=O)c1O