Reaction Details
TargetEpidermal growth factor receptor
LigandBDBM50036688
Substrate/Competitorn/a
Meas. Tech.ChEMBL_66876 (CHEMBL676067)
IC50 707.95±n/a nM
Citation Kamath, SBuolamwini, JK Receptor-guided alignment-based comparative 3D-QSAR studies of benzylidene malonitrile tyrphostins as EGFR and HER-2 kinase inhibitors. J Med Chem46:4657-68 (2003) 
 
Epidermal growth factor receptor
Name:Epidermal growth factor receptor
Type:Receptor Kinase Domain
Mol. Mass.:134279.59
Organism:Homo sapiens (Human)
Description:P00533
Residue:1210
BDBM50036688
NameBDBM50036688
Synonyms:2-[5-((E)-2-Carbamoyl-2-cyano-vinyl)-2-hydroxy-3-methoxy-benzylsulfanyl]-benzoic acid anion CHEMBL119987
TypeSmall organic molecule
Emp. Form.C19H16N2O5S
Mol. Mass.384.406
SMILESCOc1cc(\C=C(/C#N)C(N)=O)cc(CSc2ccccc2C(O)=O)c1O