Reaction Details
Target5-hydroxytryptamine receptor 6
LigandBDBM50001521
Substrate/Competitorn/a
Meas. Tech.ChEMBL_3645 (CHEMBL620782)
Ki 43±n/a nM
Citation Riemer, CBorroni, ELevet-Trafit, BMartin, JRPoli, SPorter, RHBös, M Influence of the 5-HT6 receptor on acetylcholine release in the cortex: pharmacological characterization of 4-(2-bromo-6-pyrrolidin-1-ylpyridine-4-sulfonyl)phenylamine, a potent and selective 5-HT6 receptor antagonist. J Med Chem46:1273-6 (2003) 
 
5-hydroxytryptamine receptor 6
Name:5-hydroxytryptamine receptor 6
Type:G Protein-Coupled Receptor (GPCR)
Mol. Mass.:46968.43
Organism:Homo sapiens (Human)
Description:P50406
Residue:440
BDBM50001521
NameBDBM50001521
Synonyms:CHEMBL23965
TypeSmall organic molecule
Emp. Form.C12H13BrN4O2S
Mol. Mass.357.226
SMILESCNc1cc(cc(Br)n1)S(=O)(=O)Nc1ccc(N)cc1