Reaction Details
Target5-hydroxytryptamine receptor 6
LigandBDBM50001523
Substrate/Competitorn/a
Meas. Tech.ChEMBL_3645 (CHEMBL620782)
Ki 2.3±n/a nM
Citation Riemer, CBorroni, ELevet-Trafit, BMartin, JRPoli, SPorter, RHBös, M Influence of the 5-HT6 receptor on acetylcholine release in the cortex: pharmacological characterization of 4-(2-bromo-6-pyrrolidin-1-ylpyridine-4-sulfonyl)phenylamine, a potent and selective 5-HT6 receptor antagonist. J Med Chem46:1273-6 (2003) 
 
5-hydroxytryptamine receptor 6
Name:5-hydroxytryptamine receptor 6
Type:G Protein-Coupled Receptor (GPCR)
Mol. Mass.:46968.43
Organism:Homo sapiens (Human)
Description:P50406
Residue:440
BDBM50001523
NameBDBM50001523
Synonyms:CHEMBL23575
TypeSmall organic molecule
Emp. Form.C12H12BrN3O2S
Mol. Mass.342.212
SMILESCNc1cc(cc(Br)n1)S(=O)(=O)c1ccc(N)cc1