Reaction Details
TargetIntegrase
LigandBDBM50409877
Substrate/Competitorn/a
Meas. Tech.ChEMBL_88770 (CHEMBL701802)
IC50 3981.07±n/a nM
Citation Kuo, CLAssefa, HKamath, SBrzozowski, ZSlawinski, JSaczewski, FBuolamwini, JKNeamati, N Application of CoMFA and CoMSIA 3D-QSAR and docking studies in optimization of mercaptobenzenesulfonamides as HIV-1 integrase inhibitors. J Med Chem47:385-99 (2004) 
 
Integrase
Name:Integrase
Synonyms:Human immunodeficiency virus type 1 integrase
Type:PROTEIN
Mol. Mass.:32231.48
Organism:Human immunodeficiency virus 1
Description:ChEMBL_90865
Residue:288
BDBM50409877
NameBDBM50409877
Synonyms:CHEMBL338228
TypeSmall organic molecule
Emp. Form.C22H17Cl2N5O3S2
Mol. Mass.534.438
SMILESCc1ccc(cc1)-n1cnnc1NS(=O)(=O)c1cc(C(=O)Nc2ccc(Cl)cc2)c(Cl)cc1S