Reaction Details
TargetSynaptic vesicle glycoprotein 2A
LigandBDBM50422542
Substrate/Competitorn/a
Meas. Tech.ChEMBL_100153 (CHEMBL857182)
IC50 794±n/a nM
Citation Kenda, BMMatagne, ACTalaga, PEPasau, PMDifferding, ELallemand, BIFrycia, AMMoureau, FGKlitgaard, HVGillard, MRFuks, BMichel, P Discovery of 4-substituted pyrrolidone butanamides as new agents with significant antiepileptic activity. J Med Chem47:530-49 (2004) 
 
Synaptic vesicle glycoprotein 2A
Name:Synaptic vesicle glycoprotein 2A
Type:PROTEIN
Mol. Mass.:82648.76
Organism:Rattus norvegicus
Description:ChEMBL_100153
Residue:742
BDBM50422542
NameBDBM50422542
Synonyms:Keppra LEVETIRACETAM UCB-22059 | UCB-L059
TypeSmall organic molecule
Emp. Form.C8H14N2O2
Mol. Mass.170.209
SMILESCC[C@H](N1CCCC1=O)C(N)=O