Reaction Details
TargetATP synthase subunit gamma, mitochondrial
LigandBDBM50012957
Substrate/Competitorn/a
Meas. Tech.ChEMBL_65923 (CHEMBL678318)
IC50>100000±n/a nM
Citation Atwal, KSWang, PRogers, WLSleph, PMonshizadegan, HFerrara, FNTraeger, SGreen, DWGrover, GJ Small molecule mitochondrial F1F0 ATPase hydrolase inhibitors as cardioprotective agents. Identification of 4-(N-arylimidazole)-substituted benzopyran derivatives as selective hydrolase inhibitors. J Med Chem47:1081-4 (2004) 
 
ATP synthase subunit gamma, mitochondrial
Name:ATP synthase subunit gamma, mitochondrial
Type:PROTEIN
Mol. Mass.:33081.70
Organism:Bos taurus
Description:ChEMBL_65923
Residue:298
BDBM50012957
NameBDBM50012957
Synonyms:1-((p-(2-(5-chloro-o-anisamido)ethyl)phenyl)sulfonyl)-3-cyclohexylurea 5-chloro-N-(2-(4-((((cyclohexylamino)carbonyl)amino)sulfonyl)phenyl)ethyl)-2-methoxybenzamide CHEMBL472 Glibenclamide | US20230348371, Compound 5
TypeSmall organic molecule
Emp. Form.C23H28ClN3O5S
Mol. Mass.494.004
SMILESCOc1ccc(Cl)cc1C(=O)NCCc1ccc(cc1)S(=O)(=O)NC(=O)NC1CCCCC1