Reaction Details
TargetGonadotropin-releasing hormone receptor
LigandBDBM50001569
Substrate/Competitorn/a
Meas. Tech.ChEMBL_100148 (CHEMBL712505)
Ki 214±n/a nM
Citation Randolph, JTWaid, PNichols, CSauer, DHaviv, FDiaz, GBammert, GBesecke, LMSegreti, JAMohning, KMBush, ENWegner, CDGreer, J Nonpeptide luteinizing hormone-releasing hormone antagonists derived from erythromycin A: design, synthesis, and biological activity of cladinose replacement analogues. J Med Chem47:1085-97 (2004) 
 
Gonadotropin-releasing hormone receptor
Name:Gonadotropin-releasing hormone receptor
Type:Enzyme
Mol. Mass.:37749.45
Organism:Homo sapiens (Human)
Description:P30968
Residue:328
BDBM50001569
NameBDBM50001569
Synonyms:CHEMBL268489
TypeSmall organic molecule
Emp. Form.C46H71ClN2O12
Mol. Mass.879.515
SMILES[H][C@@]12[C@@H](C)C(=O)[C@H](C)C[C@](C)(OC)[C@H](OC3O[C@H](C)C[C@@H]([C@H]3O)N(C)C(C)C)[C@@H](C)[C@H](OC(=O)C3CCOC3)[C@@H](C)C(=O)O[C@H](CC)[C@@]1(C)OC(=O)N2CCc1ccc(Cl)cc1