Reaction Details
TargetPotassium voltage-gated channel subfamily H member 2
LigandBDBM22873
Substrate/Competitorn/a
Meas. Tech.ChEMBL_307245 (CHEMBL829152)
IC50 3019.95±n/a nM
Citation Tobita, MNishikawa, TNagashima, R A discriminant model constructed by the support vector machine method for HERG potassium channel inhibitors. Bioorg Med Chem Lett15:2886-90 (2005) 
 
Potassium voltage-gated channel subfamily H member 2
Name:Potassium voltage-gated channel subfamily H member 2
Type:Multi-pass membrane protein
Mol. Mass.:126672.65
Organism:Homo sapiens (Human)
Description:Q12809
Residue:1159
BDBM22873
NameBDBM22873
Synonyms:1-(4-tert-butylphenyl)-4-[4-(diphenylmethoxy)piperidin-1-yl]butan-1-one CHEMBL305660 Kestine | NCGC00164603
TypeSmall organic molecule
Emp. Form.C32H39NO2
Mol. Mass.469.6576
SMILESCC(C)(C)c1ccc(cc1)C(=O)CCCN1CCC(CC1)OC(c1ccccc1)c1ccccc1